{"text_format":"1","workbook":"xlsx","n_sheets":3,"sheets":["使い方","身長","テンプレート"],"not_rendered":{"charts":1,"images":5,"macros":1,"external_links":0,"defined_names":2,"comments":0,"pivot_tables":0},"unopened":[],"bounds":{"document_bytes":16777216,"sheet_cells":100000,"rows_first":2000,"rows_last":500,"rows_between":2000,"halvings":0,"cell_chars":16384,"cell_head_chars":4096},"cells_cut":0,"cells_raw":0,"read":"whole","date_system":"1900"}

{"sheet":"使い方","index":0,"n_rows":0,"n_cols":0,"rows_kept":0,"cut":false,"hidden":false,"merged":[]}

{"sheet":"身長","index":1,"n_rows":125,"n_cols":10,"rows_kept":125,"cut":false,"hidden":false,"merged":[]}
["番号","学年","ｸﾗｽ","Ｎｏ","性","児童名","１年４月身長","２年４月身長","３年4月身長","４年4月体重"]
[{"$f":"ROW()-1","v":1},4,null,1,"男","川邊　裕作",118.9,126.3,132.80000000000001,137.1]
[2,4,null,2,"女","両角　知子",114.9,122,128.30000000000001,134.6]
[3,4,null,3,"女","村瀬　智美",113.4,118.6,124.6,129.19999999999999]
[4,null,null,4,"男","大竹　康平",115.9,123.1,130.19999999999999,137.4]
[5,null,null,5,"女","隈部　文",118,123.1,130,134.9]
[6]
[7]
[8]
[9]
[10]
[11]
[12]
[13]
[14]
[15]
[16]
[17]
[18]
[19]
[20]
[21]
[22]
[23]
[24]
[25]
[26]
[{"$f":"ROW()-1","v":27}]
[28]
[29]
[30]
[31]
[32]
[33]
[34]
[35]
[36]
[37]
[38]
[39]
[40]
[{"$f":"ROW()-1","v":41}]
[42]
[43]
[44]
[45]
[46]
[47]
[48]
[49]
[50]
[51]
[52]
[53]
[54]
[55]
[56]
[57]
[58]
[59]
[60]
[61]
[62]
[{"$f":"ROW()-1","v":63}]
[64]
[{"$f":"ROW()-1","v":65}]
[66]
[67]
[68]
[69]
[70]
[71]
[72]
[73]
[74]
[75]
[76]
[77]
[78]
[79]
[80]
[{"$f":"ROW()-1","v":81}]
[82]
[83]
[84]
[85]
[86]
[87]
[88]
[89]
[90]
[91]
[92]
[93]
[94]
[95]
[96]
[97]
[98]
[99]
[100]
[101]
[102]
[103]
[104]
[105]
[106]
[107]
[108]
[109]
[110]
[111]
[112]
[113]
[114]
[115]
[116]
[117]
[118]
[119]
[120]
[121]
[122]
[123]
[124]

{"sheet":"テンプレート","index":2,"n_rows":32,"n_cols":37,"rows_kept":32,"cut":false,"hidden":false,"merged":[[1,5,1,7],[28,9,28,12],[33,10,33,14]]}
[]
[null,null,null,null,null,{"$f":"VLOOKUP($Q$3,身長!$A:$J,6)","v":"川邊　裕作"},{"$f":"VLOOKUP($Q$3,身長!$A:$J,7)","v":118.9},{"$f":"VLOOKUP($Q$3,身長!$A:$J,7)","v":118.9},"さん"]
[null,null,null,null,null,null,null,null,null,null,null,null,null,null,null,null,1]
[null,null,null,null,null,null,null,null,null,null,null,null,null,null,null,null,null,null,null,null,null,null,null,null,null,null,null,null,null,null,null,null,null,null,null,2,2]
[]
[]
[]
[]
[]
[]
[]
[]
[]
[]
[]
[]
[]
[]
[]
[]
[]
[]
[]
[]
[]
[]
[]
[]
[null,null,null,null,null,null,null,null,null,"１年間で成長した分"]
[null,null,null,"1年生の1年間",{"$f":"VLOOKUP($Q$3,身長!$A:$J,8)","v":126.3},"ｃｍ","－",{"$f":"VLOOKUP($Q$3,身長!$A:$J,7)","v":118.9},"ｃｍ","＝",{"$f":"E30-H30","v":7.3999999999999915},"ｃｍ"]
[null,null,null,"2年生の1年間",{"$f":"VLOOKUP($Q$3,身長!$A:$J,9)","v":132.80000000000001},"ｃｍ","－",{"$f":"VLOOKUP($Q$3,身長!$A:$J,8)","v":126.3},"ｃｍ","＝",{"$f":"E31-H31","v":6.5000000000000142},"ｃｍ"]
[null,null,null,"3年生の1年間",{"$f":"VLOOKUP($Q$3,身長!$A:$J,10)","v":137.1},"ｃｍ","－",{"$f":"VLOOKUP($Q$3,身長!$A:$J,9)","v":132.80000000000001},"ｃｍ","＝",{"$f":"E32-H32","v":4.2999999999999829},"ｃｍ"]