{"text_format":"1","workbook":"xlsx","n_sheets":4,"sheets":["入力","様式","計算","リスト"],"not_rendered":{"charts":0,"images":2,"macros":1,"external_links":0,"defined_names":10,"comments":0,"pivot_tables":0},"unopened":[],"bounds":{"document_bytes":16777216,"sheet_cells":100000,"rows_first":2000,"rows_last":500,"rows_between":2000,"halvings":0,"cell_chars":16384,"cell_head_chars":4096},"cells_cut":0,"cells_raw":0,"read":"whole","date_system":"1900"}

{"sheet":"入力","index":0,"n_rows":30,"n_cols":6,"rows_kept":30,"cut":false,"hidden":false,"merged":[]}
["黄色のセルのみ入力してください。"]
["項目名","入力欄","備考欄"]
["基準日","2023-12-31","申請年の年末日を入力（R○.12.31）"]
["所轄税務署長","名古屋中"]
["給与支払者","愛知県教育委員会　尾張教育事務所"]
["給与支払者の法人番号",1000020230006]
["給与支払者の所在地",{"$f":"VLOOKUP($B$5,リスト!$G$1:$H$3,2,0)","v":"名古屋市中区三の丸2-6-1"}]
["あなたの氏名"]
["あなたの氏名（フリガナ）",null,"カタカナで入力。"]
["あなたの住所又は居所",null,"原則として住民票の住所を入力。"]
["あなたの収入金額",null,"整数で入力。申請する年の1/1～12/31までの給与収入（総額）を入力。（※育休手当などの共済組合の給付金は含めない）収入がない場合は0と入力する。\nわからない場合は右の欄で概算額を出す→","今年は何月から勤務していましたか？","1月","講師の場合は他の任用も合わせて勤務開始した月を選択。"]
["あなたの給与所得以外の所得の合計額",null,"整数で入力。給与所得以外の所得がなければ空欄。","あなたの最新の給料総額（月額）",null,"整数で入力。給与明細の「支給総額」の金額を入力。\n※手取り額を入力ではないので注意！"]
["配偶者の氏名",null,"配偶者なしまたは配偶者を扶養していない場合（目安として給与収入約201万円程度以上）は入力不要。\n※配偶者欄はあなたの合計所得金額（見込額）が1000万円を超える場合は入力不可です。","あなたの収入金額（自動計算）",{"$f":"IFERROR($E$12*VLOOKUP($E$11,月数,4,0),\"\")","v":0}]
["配偶者の氏名（フリガナ）",null,"カタカナで入力。"]
["配偶者の個人番号",null,"12桁の個人番号（マイナンバー）。提出済みの場合は空欄可。"]
["配偶者の生年月日",null,"H10.10.10のように入力。"]
["配偶者の住所又は居所",null,"あなたと別の住所または居所になっている場合に入力。同居の場合は空欄。"]
["非居住者である配偶者",null,"配偶者が海外に一年以上居住している場合に選択。それ以外は空欄。"]
["生計を一にする事実",null,"上記で「○」を選択した場合に送金額（年額）を入力。"]
["配偶者の収入金額",null,"配偶者なしまたは配偶者を扶養していない場合（目安として給与収入約201万円程度以上）は入力不要。整数で入力。申請する年の1/1～12/31までの給与収入（総額）を入力。（※育休手当などの共済組合の給付金は含めない）収入がない場合は0と入力する。"]
["配偶者の給与所得以外の所得の合計額",null,"整数で入力。給与所得以外の所得がなければ空欄。"]
["所得金額調整控除",null,"ここから下はあなたの年間合計給与収入が850万円以下の場合入力不要。\n850万円超の場合は要件を選択。複数該当する場合はいずれか一つだけ選択。（該当の扶養親族が複数人いても一人分だけ入力）\n※配偶者が扶養親族を税法上の扶養をしている場合でもあなたの給与収入が850万円を超えていれば夫婦両方で申請が可能性です。23歳未満の子どもや障害者の扶養親族がいる場合はよく確認してください。","あなたの年間合計給与収入"]
["同一生計配偶者又は扶養親族の氏名",null,null,{"$f":"計算!$A$2","v":0}]
["同一生計配偶者又は扶養親族の氏名（フリガナ）",null,"カタカナで入力。",{"$f":"IF($D$23<=8500000,\"←入力不要です\",\"←入力可能です\")","v":"←入力不要です"}]
["同一生計配偶者又は扶養親族の個人番号",null,"12桁の個人番号（マイナンバー）。提出済みの場合は空欄可。"]
["同一生計配偶者又は扶養親族の生年月日",null,"H10.10.10のように入力。"]
["同一生計配偶者又は扶養親族の住所又は居所",null,"あなたと別の住所または居所になっている場合に入力。"]
["上記の者のあなたとの続柄"]
["上記の者の収入金額",null,"整数で入力。給与所得以外の所得がなければ空欄。","合計所得金額（見込額）"]
["特別障害者に該当する事実",null,"障害の状態または交付を受けている手帳などの種類と交付年月日を記載。\n扶養控除等申告書に記載している場合は入力不要。",{"$f":"IFERROR(計算!$Y$4,\"\")","v":""}]

{"sheet":"様式","index":1,"n_rows":88,"n_cols":117,"rows_kept":88,"cut":false,"hidden":false,"merged":[[87,1,87,113],[79,39,86,40],[79,97,86,98],[79,41,82,60],[83,41,84,60],[79,27,80,37],[81,27,82,37],[83,27,84,37],[85,27,86,37],[83,5,84,21],[85,5,86,21],[85,61,86,84],[83,90,84,95],[85,90,86,94],[79,85,79,95],[79,99,81,113],[82,99,82,113],[80,61,82,84],[80,85,82,95],[86,99,86,113],[83,99,85,113],[79,3,80,4],[81,3,82,4],[83,3,84,4],[85,3,86,4],[79,1,86,2],[79,5,80,21],[81,5,82,21],[69,34,70,44],[85,41,86,60],[78,2,78,113],[57,28,64,32],[65,28,66,32],[67,28,68,32],[83,61,84,84],[79,61,79,84],[83,85,84,89],[85,85,86,89],[61,16,62,24],[67,4,68,5],[67,16,68,24],[67,25,68,27],[57,6,58,14],[67,97,68,101],[67,77,68,81],[63,82,64,86],[65,82,66,86],[73,0,74,114],[75,2,75,113],[76,2,76,113],[25,72,27,95],[25,96,27,113],[57,34,58,44],[59,34,61,44],[62,34,62,44],[64,34,65,44],[66,34,68,42],[66,43,68,44],[63,25,64,27],[65,6,66,14],[65,16,66,24],[65,25,66,27],[67,6,68,14],[61,25,62,27],[63,6,64,14],[63,16,64,24],[57,16,58,24],[59,6,60,14],[59,16,60,24],[61,6,62,14],[55,1,56,44],[57,4,58,5],[59,4,60,5],[38,1,43,2],[44,1,49,2],[36,1,37,12],[36,13,37,28],[36,29,37,44],[50,1,53,28],[50,29,53,42],[52,43,53,44],[48,43,49,44],[39,29,43,42],[38,29,38,44],[44,29,44,44],[45,29,49,42],[38,13,43,26],[44,13,49,28],[57,1,68,3],[57,25,58,27],[59,25,60,27],[61,4,62,5],[63,4,64,5],[65,4,66,5],[34,1,35,44],[38,3,43,12],[44,3,49,12],[42,27,43,28],[42,43,43,44],[69,59,70,101],[59,103,61,111],[64,103,66,111],[62,103,63,113],[57,103,58,113],[60,112,61,113],[65,112,66,113],[67,103,69,113],[63,51,64,52],[65,51,66,52],[67,51,68,52],[63,49,68,50],[69,49,70,52],[69,53,70,58],[63,92,64,96],[65,92,66,96],[67,92,68,96],[63,97,64,101],[65,97,66,101],[67,53,68,55],[63,56,64,58],[65,56,66,58],[67,56,68,58],[63,59,64,61],[65,59,66,61],[67,59,68,61],[61,82,62,86],[61,87,62,91],[67,82,68,86],[63,87,64,91],[65,87,66,91],[67,87,68,91],[67,62,68,66],[63,67,64,71],[65,67,66,71],[67,67,68,71],[63,72,64,76],[65,72,66,76],[67,72,68,76],[61,92,62,96],[61,97,62,101],[63,53,64,55],[65,53,66,55],[63,62,64,66],[65,62,66,66],[63,77,64,81],[65,77,66,81],[57,49,62,52],[57,53,58,101],[59,53,62,55],[59,56,62,58],[59,59,62,61],[59,62,60,101],[61,62,62,66],[61,67,62,71],[61,72,62,76],[61,77,62,81],[51,100,52,113],[53,100,53,113],[55,49,56,114],[48,109,50,111],[36,94,40,95],[41,94,44,95],[45,94,47,95],[48,94,50,95],[36,96,40,108],[41,96,44,108],[45,96,47,108],[48,96,50,108],[38,49,43,50],[38,51,43,60],[38,61,43,72],[39,75,43,86],[36,92,50,93],[36,112,44,113],[45,112,50,113],[36,109,40,111],[41,109,44,111],[45,109,47,111],[44,49,49,50],[28,72,29,95],[44,51,49,60],[44,61,49,74],[52,87,53,88],[50,75,51,76],[50,49,53,74],[50,77,53,86],[38,75,38,88],[42,87,43,88],[44,75,44,88],[48,87,49,88],[45,75,49,86],[42,73,43,74],[51,92,53,99],[1,0,4,119],[15,48,17,98],[19,49,20,114],[18,1,18,45],[19,2,19,45],[20,3,20,45],[21,3,21,45],[22,2,22,45],[23,3,23,45],[15,0,17,45],[5,9,7,22],[8,9,10,22],[11,9,13,22],[5,60,6,98],[11,60,13,98],[11,49,13,59],[21,49,23,114],[5,49,10,59],[9,23,10,48],[7,60,10,98],[7,0,11,8],[18,116,66,118],[8,23,8,48],[11,23,13,48],[77,2,77,113],[5,23,7,48],[5,0,6,8],[12,0,13,8],[26,2,26,45],[27,2,27,45],[28,2,28,45],[30,0,32,45],[24,3,24,45],[25,1,25,45],[34,49,35,114],[36,49,37,60],[36,61,37,74],[36,75,37,88],[24,49,27,71],[28,49,29,71],[30,49,32,71],[30,72,32,95],[30,96,32,102],[30,103,32,113],[24,72,24,95],[24,96,24,113],[28,96,29,102],[28,103,29,113]]}
[]
["令和５年分    給与所得者の基礎控除申告書 兼 給与所得者の配偶者控除等申告書 兼 所得金額調整控除申告書"]
[]
[]
[]
["所轄税務署長",null,null,null,null,null,null,null,null,"給  与  の  支  払  者  の\n名     称 （  氏     名 ）",null,null,null,null,null,null,null,null,null,null,null,null,null,{"$f":"入力!$B$5","v":"愛知県教育委員会　尾張教育事務所"},null,null,null,null,null,null,null,null,null,null,null,null,null,null,null,null,null,null,null,null,null,null,null,null,null,"(  フ リ ガ ナ  )\nあなたの氏名",null,null,null,null,null,null,null,null,null,null,{"$f":"入力!$B$9","v":0}]
[]
[{"$f":"入力!$B$4","v":"名古屋中"},null,null,null,null,null,null,null,null,null,null,null,null,null,null,null,null,null,null,null,null,null,null,null,null,null,null,null,null,null,null,null,null,null,null,null,null,null,null,null,null,null,null,null,null,null,null,null,null,null,null,null,null,null,null,null,null,null,null,null,{"$f":"入力!$B$8","v":0}]
[null,null,null,null,null,null,null,null,null,"給  与  の  支  払  者  の\n法       人       番       号",null,null,null,null,null,null,null,null,null,null,null,null,null,"※  この申告書の提出を受けた給与の支払者（個人を除きます。）が記載してください。"]
[null,null,null,null,null,null,null,null,null,null,null,null,null,null,null,null,null,null,null,null,null,null,null,{"$f":"DBCS(入力!$B$6)","v":"１００００２０２３０００６"}]
[]
[null,null,null,null,null,null,null,null,null,"給  与  の  支  払  者  の\n所    在    地（住    所）",null,null,null,null,null,null,null,null,null,null,null,null,null,{"$f":"入力!$B$7","v":"名古屋市中区三の丸2-6-1"},null,null,null,null,null,null,null,null,null,null,null,null,null,null,null,null,null,null,null,null,null,null,null,null,null,"あ な た の 住 所\n又    は    居    所",null,null,null,null,null,null,null,null,null,null,{"$f":"入力!$B$10","v":0}]
["税務署長"]
[]
[]
["～記載に当たってのご注意～",null,null,null,null,null,null,null,null,null,null,null,null,null,null,null,null,null,null,null,null,null,null,null,null,null,null,null,null,null,null,null,null,null,null,null,null,null,null,null,null,null,null,null,null,null,null,null,"◆ 給与所得者の配偶者控除等申告書 ◆"]
[]
[]
[null,"◎ 「基礎控除申告書」と「配偶者控除等申告書」については、次の場合に応じて記載してください。 ",null,null,null,null,null,null,null,null,null,null,null,null,null,null,null,null,null,null,null,null,null,null,null,null,null,null,null,null,null,null,null,null,null,null,null,null,null,null,null,null,null,null,null,null,null,null,null,null,null,null,null,null,null,null,null,null,null,null,null,null,null,null,null,null,null,null,null,null,null,null,null,null,null,null,null,null,null,null,null,null,null,null,null,null,null,null,null,null,null,null,null,null,null,null,null,null,null,null,null,null,null,null,null,null,null,null,null,null,null,null,null,null,null,null,"◎この申告書の記載に当たっては、裏面の説明をお読みください。"]
[null,null,"１  あなたの本年中の合計所得金額の見積額が1,000万円以下で、かつ、配偶者の本年中の合計",null,null,null,null,null,null,null,null,null,null,null,null,null,null,null,null,null,null,null,null,null,null,null,null,null,null,null,null,null,null,null,null,null,null,null,null,null,null,null,null,null,null,null,null,null,null,"○  「控除額の計算」の表の「区分Ⅰ」欄については、「基礎控除申告書」の「区分Ⅰ」欄を参照してください。"]
[null,null,null,"所得金額の見積額が133万円以下である場合は、「基礎控除申告書」、「配偶者控除等申告書」"]
[null,null,null,"の順に記載してください。",null,null,null,null,null,null,null,null,null,null,null,null,null,null,null,null,null,null,null,null,null,null,null,null,null,null,null,null,null,null,null,null,null,null,null,null,null,null,null,null,null,null,null,null,null,"○  「基礎控除申告書」の「区分Ⅰ」欄が(A)～(C)に該当しない場合や「配偶者控除等申告書」の「区分Ⅱ」欄が①～④に該当しない場合は、配偶者控除及び\n　配偶者特別控除の適用を受けることはできません。    "]
[null,null,"２  上記１以外で、かつ、あなたの本年中の合計所得金額の見積額が2,500万円以下である場合"]
[null,null,null,"は、「基礎控除申告書」のみ記載してください（「配偶者控除等申告書」を記載する必要はあり"]
[null,null,null,"ません。）。",null,null,null,null,null,null,null,null,null,null,null,null,null,null,null,null,null,null,null,null,null,null,null,null,null,null,null,null,null,null,null,null,null,null,null,null,null,null,null,null,null,null,null,null,null,"（  フ  リ  ガ  ナ  ）\n配  偶  者  の  氏  名",null,null,null,null,null,null,null,null,null,null,null,null,null,null,null,null,null,null,null,null,null,null,"配        偶        者        の        個        人        番        号",null,null,null,null,null,null,null,null,null,null,null,null,null,null,null,null,null,null,null,null,null,null,null,"配      偶      者      の       生      年       月      日"]
[null,"◎ 「所得金額調整控除申告書」については、年末調整において所得金額調整控除の適用を受け",null,null,null,null,null,null,null,null,null,null,null,null,null,null,null,null,null,null,null,null,null,null,null,null,null,null,null,null,null,null,null,null,null,null,null,null,null,null,null,null,null,null,null,null,null,null,null,null,null,null,null,null,null,null,null,null,null,null,null,null,null,null,null,null,null,null,null,null,null,null,{"$f":"IF(入力!$B$15=\"\",\"\",DBCS(入力!$B$15))","v":""},null,null,null,null,null,null,null,null,null,null,null,null,null,null,null,null,null,null,null,null,null,null,null,{"$f":"IF(入力!$B$16=\"\",\"\",入力!$B$16)","v":""}]
[null,null,"ようとする場合に記載してください。なお、あなたの本年中の年末調整の対象となる給与の収入"]
[null,null,"金額が850万円以下である場合又は「所得金額調整控除申告書」の「要件」欄の各項目のいずれ"]
[null,null,"にも該当しない場合には、所得金額調整控除の適用を受けることはできません。",null,null,null,null,null,null,null,null,null,null,null,null,null,null,null,null,null,null,null,null,null,null,null,null,null,null,null,null,null,null,null,null,null,null,null,null,null,null,null,null,null,null,null,null,null,null,{"$f":"IF(入力!$B$14=\"\",\"\",入力!$B$14)","v":""},null,null,null,null,null,null,null,null,null,null,null,null,null,null,null,null,null,null,null,null,null,null,"あ   な   た   と   配   偶   者   の   住   所   又   は   居   所   が\n異  な  る  場  合  の  配  偶  者  の  住  所  又  は  居  所",null,null,null,null,null,null,null,null,null,null,null,null,null,null,null,null,null,null,null,null,null,null,null,"非    居    住    者\nで あ る 配 偶 者",null,null,null,null,null,null,"生  計  を  一  に  す  る  事  実"]
[]
["◆ 給与所得者の基礎控除申告書 ◆",null,null,null,null,null,null,null,null,null,null,null,null,null,null,null,null,null,null,null,null,null,null,null,null,null,null,null,null,null,null,null,null,null,null,null,null,null,null,null,null,null,null,null,null,null,null,null,null,{"$f":"IF(入力!$B$13=\"\",\"\",入力!$B$13)","v":""},null,null,null,null,null,null,null,null,null,null,null,null,null,null,null,null,null,null,null,null,null,null,{"$f":"IF(入力!$B$17=\"\",\"\",入力!$B$17)","v":""},null,null,null,null,null,null,null,null,null,null,null,null,null,null,null,null,null,null,null,null,null,null,null,{"$f":"IF(入力!$B$18=\"\",\"\",入力!$B$18)","v":""},null,null,null,null,null,null,{"$f":"IF(入力!$B$19=\"\",\"\",入力!$B$19)","v":""}]
[]
[]
[]
[null,"○  あなたの本年中の合計所得金額の見積額の計算",null,null,null,null,null,null,null,null,null,null,null,null,null,null,null,null,null,null,null,null,null,null,null,null,null,null,null,null,null,null,null,null,null,null,null,null,null,null,null,null,null,null,null,null,null,null,null,"○  配偶者の本年中の合計所得金額の見積額の計算     "]
[]
[null,"所   得   の   種   類",null,null,null,null,null,null,null,null,null,null,null,"収      入      金      額",null,null,null,null,null,null,null,null,null,null,null,null,null,null,null,"所       得       金       額",null,null,null,null,null,null,null,null,null,null,null,null,null,null,null,null,null,null,null,"所   得   の   種   類",null,null,null,null,null,null,null,null,null,null,null,"収      入      金      額",null,null,null,null,null,null,null,null,null,null,null,null,null,"所       得       金       額",null,null,null,null,null,null,null,null,null,null,null,null,null,null,null,null,"判定",null,null,null,{"$f":"\"48万円以下かつ年齢70歳以上\n （\"&TEXT(DATE(YEAR(入力!B3)-69, 1, 1),\"ggyy.m.d\")&\"以前生）\n《老人控除対象配偶者に該当》\"","v":"48万円以下かつ年齢70歳以上\n （昭29.1.1以前生）\n《老人控除対象配偶者に該当》"},null,null,null,null,null,null,null,null,null,null,null,null,"（①）",null,null,"配偶者控除"]
[]
[null,-1,null,"給   与   所   得",null,null,null,null,null,null,null,null,null,{"$f":"IFERROR(IF(入力!$B$11=\"\",入力!$E$13,入力!$B$11),\"\")","v":0},null,null,null,null,null,null,null,null,null,null,null,null,null,null,null,"(裏面「４⑴」を参照）",null,null,null,null,null,null,null,null,null,null,null,null,null,null,null,null,null,null,null,-1,null,"給   与   所   得",null,null,null,null,null,null,null,null,null,{"$f":"IF(入力!$B$20=\"\",\"\",入力!$B$20)","v":""},null,null,null,null,null,null,null,null,null,null,null,null,null,"(裏面「４⑴」を参照）"]
[null,null,null,null,null,null,null,null,null,null,null,null,null,null,null,null,null,null,null,null,null,null,null,null,null,null,null,null,null,{"$f":"計算!$A$7","v":0},null,null,null,null,null,null,null,null,null,null,null,null,null,null,null,null,null,null,null,null,null,null,null,null,null,null,null,null,null,null,null,null,null,null,null,null,null,null,null,null,null,null,null,null,null,{"$f":"IFERROR(計算!$A$9,\"\")","v":""}]
{"$rows_left_out":49}
{"sheet":"計算","index":2,"n_rows":21,"n_cols":27,"rows_kept":21,"cut":false,"hidden":true,"merged":[]}
["本人収入","以上","計算１","計算２",null,"本人見積額","控除","計算３","区分１",null,"区分２","条件１","条件２","A","B","C",null,"A",2,null,"所得金額調整控除",null,"以上","計算１","扶養収入",null,"特別障害者判定"]
[{"$f":"様式!$N$39","v":0},0,0,0,null,{"$f":"様式!$AD$51","v":0},0,480000,"A",null,{"$f":"IFERROR(IF(AND($F$4<=480000,$A$15>=70),\"①\",IF(AND($F$4<=480000,$A$15<70),\"②\",IF(AND($F$4>480000,$F$4<=950000),\"③\",IF(AND($F$4>950000,$F$4<=1330000),\"④\",\"\")))),\"\")","v":""},"①",1,480000,320000,160000,null,"B",3,null,false,null,0,0,{"$f":"IF(入力!$B$29=\"\",\"\",入力!$B$29)","v":""},null,{"$f":"IF(入力!$B$22=\"\",\"□扶養控除等申告書のとおり\",IF(AND(OR(VLOOKUP(入力!$B$22,リスト!$E$1:$F$5,2,0)=1,VLOOKUP(入力!$B$22,リスト!$E$1:$F$5,2,0)=3),入力!$B$30=\"\"),\"☑扶養控除等申告書のとおり\",\"□扶養控除等申告書のとおり\"))","v":"□扶養控除等申告書のとおり"}]
["配偶者収入",1,0,0,null,"配偶者見積額",1,480000,"A",null,"区分判定","②",2,380000,260000,130000,null,"C",4,null,false,null,1,{"$f":"$Y$2","v":""},"合計所得"]
[{"$f":"様式!$BJ$39","v":""},551000,{"$f":"IFERROR($A$2-550000,\"\")","v":-550000},{"$f":"IFERROR($A$4-550000,\"\")","v":""},null,{"$f":"様式!$BZ$51","v":""},9000001,480000,"B",null,{"$f":"IF(AND($K$2=\"①\",$F$4<=950000),1,IF(AND($K$2=\"②\",$F$4<=950000),2,IF(AND($K$2=\"③\",$F$4<=950000),3,IF(AND($K$2=\"④\",$F$4<=1000000),4,IF(AND($K$2=\"④\",$F$4<=1050000),5,IF(AND($K$2=\"④\",$F$4<=1100000),6,IF(AND($K$2=\"④\",$F$4<=1150000),7,IF(AND($K$2=\"④\",$F$4<=1200000),8,IF(AND($K$2=\"④\",$F$4<=1250000),9,IF(AND($K$2=\"④\",$F$4<=1300000),10,IF(AND($K$2=\"④\",$F$4<=1330000),11,\"\")))))))))))","v":""},"③",3,380000,260000,130000,null,null,null,null,false,null,551000,{"$f":"$Y$2-550000","v":{"$error":"#VALUE!"}},{"$f":"IFERROR(VLOOKUP($Y$2,$W$1:$X$13,2,1),\"\")","v":""}]
[null,1619000,{"$f":"1069000","v":1069000},{"$f":"1069000","v":1069000},null,null,9500001,480000,"C",null,"配偶者控除","④",4,360000,240000,120000,null,null,null,null,false,null,1619000,{"$f":"1069000","v":1069000}]
["本人所得",1620000,{"$f":"1070000","v":1070000},{"$f":"1070000","v":1070000},null,"本人控除",10000001,480000,null,null,{"$f":"IFERROR(INDEX(配偶者,$K$4,VLOOKUP($F$7,判定,2,0)),\"\")","v":""},"④",5,310000,210000,110000,null,null,null,null,null,null,1620000,{"$f":"1070000","v":1070000}]
[{"$f":"IF($D$16<>\"\",IFERROR(VLOOKUP($A$2,計算式,2,1)-$D$17,\"\"),IFERROR(VLOOKUP($A$2,計算式,2,1),\"\"))","v":0},1622000,{"$f":"1072000","v":1072000},{"$f":"1072000","v":1072000},null,{"$f":"IFERROR(VLOOKUP($F$2,区分１,3,1),\"\")","v":"A"},24000001,320000,null,null,{"$f":"IF(OR($K$2=\"①\",$K$2=\"②\"),\"配偶者控除\",\"特別控除\")","v":"特別控除"},"④",6,260000,180000,90000,null,null,null,null,null,null,1622000,{"$f":"1072000","v":1072000}]
["配偶者所得",1624000,{"$f":"1074000","v":1074000},{"$f":"1074000","v":1074000},null,{"$f":"IFERROR(VLOOKUP($F$2,区分１,2,1),\"\")","v":480000},24500001,160000,null,null,null,"④",7,210000,140000,70000,null,null,null,null,null,null,1624000,{"$f":"1074000","v":1074000}]
[{"$f":"IFERROR(VLOOKUP($A$4,計算式,3,1),\"\")","v":""},1628000,{"$f":"IFERROR((ROUNDDOWN($A$2/4,-3))*2.4+100000,\"\")","v":100000},{"$f":"IFERROR((ROUNDDOWN($A$4/4,-3))*2.4+100000,\"\")","v":""},null,null,25000001,0,null,null,null,"④",8,160000,110000,60000,null,null,null,null,null,null,1628000,{"$f":"(ROUNDDOWN($Y$2/4,-3))*2.4+100000","v":{"$error":"#VALUE!"}}]
[null,1800000,{"$f":"IFERROR((ROUNDDOWN($A$2/4,-3))*2.8-80000,\"\")","v":-80000},{"$f":"IFERROR((ROUNDDOWN($A$4/4,-3))*2.8-80000,\"\")","v":""},null,null,null,null,null,null,null,"④",9,110000,80000,40000,null,null,null,null,null,null,1800000,{"$f":"(ROUNDDOWN($Y$2/4,-3))*2.8-80000","v":{"$error":"#VALUE!"}}]
["基準日",3600000,{"$f":"IFERROR((ROUNDDOWN($A$2/4,-3))*3.2-440000,\"\")","v":-440000},{"$f":"IFERROR((ROUNDDOWN($A$4/4,-3))*3.2-440000,\"\")","v":""},null,"900以下",{"$f":"IF($F$2<=9000000,\"✓\",\"\")","v":"✓"},"①",{"$f":"IFERROR(IF($K$2=\"①\",\"✓\",\"\"),\"\")","v":""},null,null,"④",10,60000,40000,20000,null,null,null,null,null,null,3600000,{"$f":"(ROUNDDOWN($Y$2/4,-3))*3.2-440000","v":{"$error":"#VALUE!"}}]
[{"$f":"入力!$B$3","v":"2023-12-31"},6600000,{"$f":"IFERROR($A$2*0.9-1100000,\"\")","v":-1100000},{"$f":"IFERROR($A$4*0.9-1100000,\"\")","v":""},null,"950以下",{"$f":"IF(AND($F$2>9000000,$F$2<=9500000),\"✓\",\"\")","v":""},"②",{"$f":"IFERROR(IF($K$2=\"②\",\"✓\",\"\"),\"\")","v":""},null,null,"④",11,30000,20000,10000,null,null,null,null,null,null,6600000,{"$f":"$Y$2*0.9-1100000","v":{"$error":"#VALUE!"}}]
["配偶者生年月日",8500000,{"$f":"IFERROR($A$2-1950000,\"\")","v":-1950000},{"$f":"IFERROR($A$4-1950000,\"\")","v":""},null,"1000以下",{"$f":"IF(AND($F$2>9500000,$F$2<=10000000),\"✓\",\"\")","v":""},"③",{"$f":"IFERROR(IF($K$2=\"③\",\"✓\",\"\"),\"\")","v":""},null,null,null,null,null,null,null,null,null,null,null,null,null,8500000,{"$f":"$Y$2-1950000","v":{"$error":"#VALUE!"}}]
[{"$f":"様式!$CS$26","v":""},null,null,null,null,"2400以下",{"$f":"IF(AND($F$2>10000000,$F$2<=24000000),\"✓\",\"\")","v":""},"④",{"$f":"IFERROR(IF($K$2=\"④\",\"✓\",\"\"),\"\")","v":""}]
[{"$f":"IFERROR(DATEDIF($A$14,$A$12,\"y\"),\"\")","v":""},"以上","計算１","判定",null,"2450以下",{"$f":"IF(AND($F$2>24000000,$F$2<=24500000),\"✓\",\"\")","v":""}]
[null,8500000,{"$f":"IFERROR(($A$2-8500000)*0.1,\"\")","v":-850000},{"$f":"IF(AND($A$2>=10000000,入力!$B$22<>\"\"),2,IF(AND($A$2>=8500000,入力!$B$22<>\"\"),1,\"\"))","v":""},null,"2500以下",{"$f":"IF(AND($F$2>24500000,$F$2<=25000000),\"✓\",\"\")","v":""}]
[null,10000000,{"$f":"IFERROR((10000000-8500000)*0.1,\"\")","v":150000},{"$f":"IF($D$16=2,$C$17,IF($D$16=1,$C$16,0))","v":0}]
[null,null,null,null,null,{"$f":"リスト!E2","v":"あなた自身が特別障害者"},{"$f":"IF(入力!$B$22=計算!F18,\"✓\",\"\")","v":""}]
[null,null,null,null,null,{"$f":"リスト!E3","v":"同一生計配偶者（注）が特別障害者"},{"$f":"IF(入力!$B$22=計算!F19,\"✓\",\"\")","v":""}]
[null,null,null,null,null,{"$f":"リスト!E4","v":"扶養親族が特別障害者"},{"$f":"IF(入力!$B$22=計算!F20,\"✓\",\"\")","v":""}]
[null,null,null,null,null,{"$f":"リスト!E5","v":"扶養親族が年齢23歳未満（平13.1.2以後生）"},{"$f":"IF(入力!$B$22=計算!F21,\"✓\",\"\")","v":""}]

{"sheet":"リスト","index":3,"n_rows":13,"n_cols":8,"rows_kept":13,"cut":false,"hidden":false,"merged":[]}
["月","月数","期末分","概算月数","所得金額調整控除","判定","給与支払者","給与支払者所在地"]
["1月",12,4.4000000000000004,{"$f":"SUM(B2:C2)","v":16.399999999999999},"あなた自身が特別障害者",1,"愛知県教育委員会","名古屋市中区三の丸3-1-2"]
["2月",11,4,{"$f":"SUM(B3:C3)","v":15},"同一生計配偶者（注）が特別障害者",2,"愛知県教育委員会　尾張教育事務所","名古屋市中区三の丸2-6-1"]
["3月",10,3.6,13.6,"扶養親族が特別障害者",3]
["4月",9,3.2,12.2,{"$f":"\"扶養親族が年齢23歳未満（\"&TEXT(E6,\"gge.m.d\")&\"以後生）\"","v":"扶養親族が年齢23歳未満（平13.1.2以後生）"},4]
["5月",8,2.8,10.8,{"$f":"DATE(YEAR(EDATE(入力!$B$3,-270)),1,2)","v":"2001-01-02"}]
["6月",7,2.4,9.4]
["7月",6,2,8]
["8月",5,1.6,6.6]
["9月",4,1.2,5.2]
["10月",3,0.8,3.8]
["11月",2,0.4,2.4]
["12月",1,0,1]